Target
Phosphatidylinositol 4-kinase
Ligand
BDBM533791
Substrate
Meas. Tech.
PI(4)K enzymatic Assay
IC50
<100±n/a nM
Citation
 Michael, YJRobert, TMPeichao, L COMPOUNDS AND COMPOSITIONS FOR THE TREATMENT OF CRYPTOSPORIDIOSIS WIPO 0:0 (2022) Target
Name:
Phosphatidylinositol 4-kinase
Synonyms:
Type:
Protein
Mol. Mass.:
128976.50
Organism:
Description:
Q5CVD3
Residue:
1114
 
Inhibitor
Name:
BDBM533791
Synonyms:
WO2022079616, Example 1.17 | t-Butyl 2-chloro-5-(N-methyl-3-(4-(methylcarbamoyl)phenyl)pyrazolo[1,5-a]pyridine-5-carboxamido)benzoate
Type:
Small organic molecule
Emp. Form.:
C28H27ClN4O4
Mol. Mass.:
518.991
SMILES:
CNC(=O)c1ccc(cc1)-c1cnn2ccc(cc12)C(=O)N(C)c1ccc(Cl)c(c1)C(=O)OC(C)(C)C
: