Target
Phosphatidylinositol 4-kinase
Ligand
BDBM533864
Substrate
Meas. Tech.
PI(4)K enzymatic Assay
IC50
<100±n/a nM
Citation
 Michael, YJRobert, TMPeichao, L COMPOUNDS AND COMPOSITIONS FOR THE TREATMENT OF CRYPTOSPORIDIOSIS WIPO 0:0 (2022) Target
Name:
Phosphatidylinositol 4-kinase
Synonyms:
Type:
Protein
Mol. Mass.:
128976.50
Organism:
Description:
Q5CVD3
Residue:
1114
 
Inhibitor
Name:
BDBM533864
Synonyms:
Methyl 2-chloro-5-(N-methyl-3-(4-(methylcarbamoyl)phenyl)pyrazolo[1,5-c]pyrimidine-5-carboxamido)benzoate | WO2022079616, Example 3.1
Type:
Small organic molecule
Emp. Form.:
C24H20ClN5O4
Mol. Mass.:
477.9
SMILES:
CNC(=O)c1ccc(cc1)-c1cnn2cnc(cc12)C(=O)N(C)c1ccc(Cl)c(c1)C(=O)OC
: