Target
PI3K/PI4K catalytic domain-containing protein
Ligand
BDBM533865
Substrate
IC50
550±n/a nM
Citation
 Michael, YJRobert, TMPeichao, L COMPOUNDS AND COMPOSITIONS FOR THE TREATMENT OF CRYPTOSPORIDIOSIS WIPO 0:0 (2022) Target
Name:
PI3K/PI4K catalytic domain-containing protein
Synonyms:
PI3K/PI4K domain-containing protein
Type:
Protein
Mol. Mass.:
252626.40
Organism:
Description:
A0A0S4TH36
Residue:
2159
 
Inhibitor
Name:
BDBM533865
Synonyms:
Methyl 2-(3-(4-carbamoylphenyl)-N-methylpyrazolo[1,5-a]pyridine-5-carboxamido)-5-chlorobenzoate | WO2022079616, Example 4.1
Type:
Small organic molecule
Emp. Form.:
C24H19ClN4O4
Mol. Mass.:
462.885
SMILES:
COC(=O)c1cc(Cl)ccc1N(C)C(=O)c1ccn2ncc(-c3ccc(cc3)C(N)=O)c2c1
: