Target
Histone acetyltransferase KAT6A [507-778]
Ligand
BDBM533872
Substrate
Meas. Tech.
Kat6a Activity Assay
IC50
1.42±n/a nM
Citation
 L?a, BDaniel, KAntonius, TLMichael, KNaomi, BRoman, HRoland, NStefan, GJ?rg, WAmaury, FEMatyas, GVera, PAndreas, SJames, FS SUBSTITUTED ACYL SULFONAMIDES FOR TREATING CANCER WIPO 0:0 (2022) Target
Name:
Histone acetyltransferase KAT6A [507-778]
Synonyms:
2.3.1.48 KAT6A MOZ MYST-3 Monocytic leukemia zinc finger protein Runt-related transcription factor-binding protein 2 Zinc finger protein 220
Type:
PROTEIN
Mol. Mass.:
224994.11
Organism:
Homo sapiens
Description:
Q92794[507-778]
Residue:
2004
  
Inhibitor
Name:
BDBM533872
Synonyms:
WO2022081807, Example 5
Type:
Small organic molecule
Emp. Form.:
C29H27FN2O6S
Mol. Mass.:
550.598
SMILES:
Fc1cc(cc2oc(cc12)C(=O)NS(=O)(=O)c1c(OCc2ccccc2)cccc1OC1CCC1)N1CCC1
: