Target
Histone acetyltransferase KAT6A [507-778]
Ligand
BDBM534025
Substrate
Meas. Tech.
Kat6a Activity Assay
IC50
14±n/a nM
Citation
 L?a, BDaniel, KAntonius, TLMichael, KNaomi, BRoman, HRoland, NStefan, GJ?rg, WAmaury, FEMatyas, GVera, PAndreas, SJames, FS SUBSTITUTED ACYL SULFONAMIDES FOR TREATING CANCER WIPO 0:0 (2022) Target
Name:
Histone acetyltransferase KAT6A [507-778]
Synonyms:
2.3.1.48 KAT6A MOZ MYST-3 Monocytic leukemia zinc finger protein Runt-related transcription factor-binding protein 2 Zinc finger protein 220
Type:
PROTEIN
Mol. Mass.:
224994.11
Organism:
Homo sapiens
Description:
Q92794[507-778]
Residue:
2004
  
Inhibitor
Name:
BDBM534025
Synonyms:
WO2022081807, Example 132
Type:
Small organic molecule
Emp. Form.:
C21H15ClFN3O4S
Mol. Mass.:
459.878
SMILES:
Fc1cc(cc2oc(cc12)C(=O)NS(=O)(=O)c1cccc2ccc(Cl)nc12)N1CCC1
: