Target
Histone acetyltransferase KAT6A [507-778]
Ligand
BDBM534088
Substrate
Meas. Tech.
Kat6a Activity Assay
IC50
5.07±n/a nM
Citation
 L?a, BDaniel, KAntonius, TLMichael, KNaomi, BRoman, HRoland, NStefan, GJ?rg, WAmaury, FEMatyas, GVera, PAndreas, SJames, FS SUBSTITUTED ACYL SULFONAMIDES FOR TREATING CANCER WIPO 0:0 (2022) Target
Name:
Histone acetyltransferase KAT6A [507-778]
Synonyms:
2.3.1.48 KAT6A MOZ MYST-3 Monocytic leukemia zinc finger protein Runt-related transcription factor-binding protein 2 Zinc finger protein 220
Type:
PROTEIN
Mol. Mass.:
224994.11
Organism:
Homo sapiens
Description:
Q92794[507-778]
Residue:
2004
  
Inhibitor
Name:
BDBM534088
Synonyms:
WO2022081807, Example 195
Type:
Small organic molecule
Emp. Form.:
C24H23FN4O5S
Mol. Mass.:
498.527
SMILES:
COc1ccc(cc1S(=O)(=O)NC(=O)c1cc2c(F)cc(cc2o1)N1CCC1)-c1cn(C)nc1C
: