Target
Histone acetyltransferase KAT6A [507-778]
Ligand
BDBM534104
Substrate
Meas. Tech.
Kat6a Activity Assay
IC50
7.58±n/a nM
Citation
 L?a, BDaniel, KAntonius, TLMichael, KNaomi, BRoman, HRoland, NStefan, GJ?rg, WAmaury, FEMatyas, GVera, PAndreas, SJames, FS SUBSTITUTED ACYL SULFONAMIDES FOR TREATING CANCER WIPO 0:0 (2022) Target
Name:
Histone acetyltransferase KAT6A [507-778]
Synonyms:
2.3.1.48 KAT6A MOZ MYST-3 Monocytic leukemia zinc finger protein Runt-related transcription factor-binding protein 2 Zinc finger protein 220
Type:
PROTEIN
Mol. Mass.:
224994.11
Organism:
Homo sapiens
Description:
Q92794[507-778]
Residue:
2004
  
Inhibitor
Name:
BDBM534104
Synonyms:
WO2022081807, Example 211
Type:
Small organic molecule
Emp. Form.:
C26H23FN2O6S
Mol. Mass.:
510.534
SMILES:
CCOc1ccc(Oc2ccccc2)cc1S(=O)(=O)NC(=O)c1cc2c(F)cc(cc2o1)N1CCC1
: