Target
Histone acetyltransferase KAT6A [507-778]
Ligand
BDBM534107
Substrate
Meas. Tech.
Kat6a Activity Assay
IC50
3.91±n/a nM
Citation
 L?a, BDaniel, KAntonius, TLMichael, KNaomi, BRoman, HRoland, NStefan, GJ?rg, WAmaury, FEMatyas, GVera, PAndreas, SJames, FS SUBSTITUTED ACYL SULFONAMIDES FOR TREATING CANCER WIPO 0:0 (2022) Target
Name:
Histone acetyltransferase KAT6A [507-778]
Synonyms:
2.3.1.48 KAT6A MOZ MYST-3 Monocytic leukemia zinc finger protein Runt-related transcription factor-binding protein 2 Zinc finger protein 220
Type:
PROTEIN
Mol. Mass.:
224994.11
Organism:
Homo sapiens
Description:
Q92794[507-778]
Residue:
2004
  
Inhibitor
Name:
BDBM534107
Synonyms:
6-(azetidin-1-yl)-N-[2-(cyclopropylmethoxy)-5-isopropyl-phenyl]sulfonyl-4-fluoro-benzofuran-2-carboxamide | WO2022081807, Example 214
Type:
Small organic molecule
Emp. Form.:
C25H27FN2O5S
Mol. Mass.:
486.556
SMILES:
CC(C)c1ccc(OCC2CC2)c(c1)S(=O)(=O)NC(=O)c1cc2c(F)cc(cc2o1)N1CCC1
: