Target
Histone acetyltransferase KAT6B
Ligand
BDBM534121
Substrate
Meas. Tech.
Kat6b Activity Assay
IC50
13±n/a nM
Citation
 L?a, BDaniel, KAntonius, TLMichael, KNaomi, BRoman, HRoland, NStefan, GJ?rg, WAmaury, FEMatyas, GVera, PAndreas, SJames, FS SUBSTITUTED ACYL SULFONAMIDES FOR TREATING CANCER WIPO 0:0 (2022) Target
Name:
Histone acetyltransferase KAT6B
Synonyms:
2.3.1.48 Histone acetyltransferase MOZ2 KAT6B_HUMAN MORF MOZ2 MYST4 | Monocytic leukemia zinc finger protein-related factor
Type:
PROTEIN
Mol. Mass.:
231353.44
Organism:
Homo sapiens
Description:
ChEMBL_116754
Residue:
2073
  
Inhibitor
Name:
BDBM534121
Synonyms:
WO2022081807, Example 228
Type:
Small organic molecule
Emp. Form.:
C26H29FN2O5S
Mol. Mass.:
500.582
SMILES:
CC(C)(C)c1ccc(OC2CCC2)c(c1)S(=O)(=O)NC(=O)c1cc2c(F)cc(cc2o1)N1CCC1
: