Target
Histone acetyltransferase KAT6B
Ligand
BDBM534132
Substrate
Meas. Tech.
Kat6b Activity Assay
IC50
>20000±n/a nM
Citation
 L?a, BDaniel, KAntonius, TLSimon, HNaomi, BRoman, HRoland, NStefan, GJ?rg, WAmaury, FEMatyas, GVera, PRobin, MAndreas, SJames, FS SUBSTITUTED ACYL SULFONAMIDES FOR TREATING CANCER WIPO 0:0 (2022) Target
Name:
Histone acetyltransferase KAT6B
Synonyms:
2.3.1.48 Histone acetyltransferase MOZ2 KAT6B_HUMAN MORF MOZ2 MYST4 | Monocytic leukemia zinc finger protein-related factor
Type:
PROTEIN
Mol. Mass.:
231353.44
Organism:
Homo sapiens
Description:
ChEMBL_116754
Residue:
2073
  
Inhibitor
Name:
BDBM534132
Synonyms:
N2-([1,1'-biphenyl]-2-sulfonyl)-N6,N6-dimethyl-1-benzofuran-2,6-dicarboxamide | WO2022081842, Example 8
Type:
Small organic molecule
Emp. Form.:
C24H20N2O5S
Mol. Mass.:
448.491
SMILES:
CN(C)C(=O)c1ccc2cc(oc2c1)C(=O)NS(=O)(=O)c1ccccc1-c1ccccc1
: