Target
Histone acetyltransferase KAT6A [507-778]
Ligand
BDBM534144
Substrate
Meas. Tech.
Kat6a Activity Assay
IC50
>20000±n/a nM
Citation
 L?a, BDaniel, KAntonius, TLSimon, HNaomi, BRoman, HRoland, NStefan, GJ?rg, WAmaury, FEMatyas, GVera, PRobin, MAndreas, SJames, FS SUBSTITUTED ACYL SULFONAMIDES FOR TREATING CANCER WIPO 0:0 (2022) Target
Name:
Histone acetyltransferase KAT6A [507-778]
Synonyms:
2.3.1.48 KAT6A MOZ MYST-3 Monocytic leukemia zinc finger protein Runt-related transcription factor-binding protein 2 Zinc finger protein 220
Type:
PROTEIN
Mol. Mass.:
224994.11
Organism:
Homo sapiens
Description:
Q92794[507-778]
Residue:
2004
  
Inhibitor
Name:
BDBM534144
Synonyms:
N-([1,1'-Biphenyl]-2-sulfonyl)-6-(pyridin-4-yl)-1-benzofuran-2-carboxamide | WO2022081842, Example 20
Type:
Small organic molecule
Emp. Form.:
C26H18N2O4S
Mol. Mass.:
454.497
SMILES:
O=C(NS(=O)(=O)c1ccccc1-c1ccccc1)c1cc2ccc(cc2o1)-c1ccncc1
: