Target
Histone acetyltransferase KAT6A [507-778]
Ligand
BDBM534146
Substrate
Meas. Tech.
Kat6a Activity Assay
IC50
9.48±n/a nM
Citation
 L?a, BDaniel, KAntonius, TLSimon, HNaomi, BRoman, HRoland, NStefan, GJ?rg, WAmaury, FEMatyas, GVera, PRobin, MAndreas, SJames, FS SUBSTITUTED ACYL SULFONAMIDES FOR TREATING CANCER WIPO 0:0 (2022) Target
Name:
Histone acetyltransferase KAT6A [507-778]
Synonyms:
2.3.1.48 KAT6A MOZ MYST-3 Monocytic leukemia zinc finger protein Runt-related transcription factor-binding protein 2 Zinc finger protein 220
Type:
PROTEIN
Mol. Mass.:
224994.11
Organism:
Homo sapiens
Description:
Q92794[507-778]
Residue:
2004
  
Inhibitor
Name:
BDBM534146
Synonyms:
6-Cyclopropyl-4-fluoro-N-(2-methylquinoline-8-sulfonyl)-1-benzofuran-2-carboxamide | WO2022081842, Example 22
Type:
Small organic molecule
Emp. Form.:
C22H17FN2O4S
Mol. Mass.:
424.445
SMILES:
Cc1ccc2cccc(c2n1)S(=O)(=O)NC(=O)c1cc2c(F)cc(cc2o1)C1CC1
: