Target
Replicase polyprotein 1ab
Ligand
BDBM534222
Substrate
Meas. Tech.
SARS-CoV-2 antiviral assay
EC50
10000±n/a nM
Citation
 E., LSWilliam, MJA., MPP., STPeiyuan, W PHOSPHOLIPID COMPOUNDS AND USES THEREOF WIPO 0:0 (2022) Target
Name:
Replicase polyprotein 1ab
Synonyms:
ORF1ab polyprotein pp1ab | rep
Type:
Protein
Mol. Mass.:
794070.71
Organism:
2019-nCoV
Description:
P0DTD1
Residue:
7096
  
Inhibitor
Name:
BDBM534222
Synonyms:
((2R,3S,4R,5R)-5-(4-Aminopyrrolo[2,1-f][1,2,4]triazin-7-yl)-5-cyano-3,4- dihydroxytetrahydrofuran-2-yl)methyl (2-(octyloxy)ethyl) hydrogen phosphate (26) | WO2022081973, Example 26
Type:
Small organic molecule
Emp. Form.:
C30H42N5O9P
Mol. Mass.:
647.6563
SMILES:
CCCCCCCCO[C@H](COCc1ccccc1)COP(O)(=O)OC[C@H]1O[C@](C#N)([C@H](O)[C@@H]1O)c1ccc2c(N)ncnn12
: