Target
Replicase polyprotein 1ab
Ligand
BDBM534227
Substrate
Meas. Tech.
SARS-CoV-2 antiviral assay
EC50
6300±n/a nM
Citation
 E., LSWilliam, MJA., MPP., STPeiyuan, W PHOSPHOLIPID COMPOUNDS AND USES THEREOF WIPO 0:0 (2022) Target
Name:
Replicase polyprotein 1ab
Synonyms:
ORF1ab polyprotein pp1ab | rep
Type:
Protein
Mol. Mass.:
794070.71
Organism:
2019-nCoV
Description:
P0DTD1
Residue:
7096
  
Inhibitor
Name:
BDBM534227
Synonyms:
2-(((2R)-1-(((((2R,3S,4R,5R)-5-(4-aminopyrrolo[2,1-f][1,2,4]triazin-7-yl)-5-cyano-3,4-dihydroxytetrahydrofuran-2-yl)methoxy)(hydroxy)phosphoryl)oxy)-3-(octadecyloxy)propan-2-yl)amino)benzoic acid (31) | WO2022081973, Example 31
Type:
Small organic molecule
Emp. Form.:
C38H57N6O10P
Mol. Mass.:
788.8671
SMILES:
CCCCCCCCCCCCCCCCOC[C@H](COP(O)(=O)OC[C@H]1O[C@](C#N)([C@H](O)[C@@H]1O)c1ccc2c(N)ncnn12)Nc1ccccc1C(O)=O
: