Target
Replicase polyprotein 1ab
Ligand
BDBM534259
Substrate
Meas. Tech.
SARS-CoV-2 antiviral assay
EC50
10000±n/a nM
Citation
 E., LSWilliam, MJA., MPP., STPeiyuan, W PHOSPHOLIPID COMPOUNDS AND USES THEREOF WIPO 0:0 (2022) Target
Name:
Replicase polyprotein 1ab
Synonyms:
ORF1ab polyprotein pp1ab | rep
Type:
Protein
Mol. Mass.:
794070.71
Organism:
2019-nCoV
Description:
P0DTD1
Residue:
7096
  
Inhibitor
Name:
BDBM534259
Synonyms:
WO2022081973, Example 63 | [(2R,3S,4R,5R)-5-(4-Aminopyrrolo[2,1-f][1,2,4]triazin-7-yl)-5-cyano-3,4-dihydroxy-tetrahydrofuran-2-yl]methyl 3-dodecylsulfanylpropyl hydrogen phosphate (63)
Type:
Small organic molecule
Emp. Form.:
C27H44N5O7PS
Mol. Mass.:
613.706
SMILES:
CCCCCCCCCCCCSCCCOP(O)(=O)OC[C@H]1O[C@](C#N)([C@H](O)[C@@H]1O)c1ccc2c(N)ncnn12
: