Target
Receptor-interacting serine/threonine-protein kinase 1
Ligand
BDBM534302
Substrate
Meas. Tech.
RIPK1 HTRF Binding Assay
IC50
0.50±n/a nM
Citation
 Guanglin, LJie, CDiane, DCB., FDJunqing, GC., HAXirui, HE., MMReiser, PMJianliang, SH., SSLee, VBYong-Jin, WZili, XG., YM TRIAZOLOPYRIDINYL COMPOUNDS AS KINASE INHIBITORS WIPO 0:0 (2022) Target
Name:
Receptor-interacting serine/threonine-protein kinase 1
Synonyms:
Cell death protein RIP RIP-1 RIPK1 Receptor-interacting protein 1
Type:
Enzyme Catalytic Domain
Mol. Mass.:
75926.99
Organism:
Homo sapiens (Human)
Description:
Q13546
Residue:
671
  
Inhibitor
Name:
BDBM534302
Synonyms:
WO2022086828, Example 30
Type:
Small organic molecule
Emp. Form.:
C23H19F4N5O2
Mol. Mass.:
473.4229
SMILES:
Cc1ccc(-c2ccn3nc(N)nc3c2)c(F)c1C(=O)NCC(F)(F)[C@@H](O)c1ccc(F)cc1
: