Target
Receptor-interacting serine/threonine-protein kinase 1
Ligand
BDBM534377
Substrate
Meas. Tech.
RIPK1 HTRF Binding Assay
IC50
0.30±n/a nM
Citation
 Guanglin, LJie, CDiane, DCB., FDJunqing, GC., HAXirui, HE., MMReiser, PMJianliang, SH., SSLee, VBYong-Jin, WZili, XG., YM TRIAZOLOPYRIDINYL COMPOUNDS AS KINASE INHIBITORS WIPO 0:0 (2022) Target
Name:
Receptor-interacting serine/threonine-protein kinase 1
Synonyms:
Cell death protein RIP RIP-1 RIPK1 Receptor-interacting protein 1
Type:
Enzyme Catalytic Domain
Mol. Mass.:
75926.99
Organism:
Homo sapiens (Human)
Description:
Q13546
Residue:
671
  
Inhibitor
Name:
BDBM534377
Synonyms:
5-(2-amino-[1,2,4]triazolo[1,5-α]pyridin-7-yl)-N-(3-(4-chlorophenyl)-2,2-difluoro-3-hydroxypropyl)-3,4-difluoro-2 -methylbenzamide enantiomer 1 | WO2022086828, Example 104
Type:
Small organic molecule
Emp. Form.:
C23H18ClF4N5O2
Mol. Mass.:
507.868
SMILES:
Cc1c(F)c(F)c(cc1C(=O)NCC(F)(F)[C@@H](O)c1ccc(Cl)cc1)-c1ccn2nc(N)nc2c1
: