Target
Mixed lineage kinase domain-like protein
Ligand
BDBM534404
Substrate
Meas. Tech.
MLKL Phosphorylation High-Content Assay
IC50
0.60±n/a nM
Citation
 Guanglin, LJie, CDiane, DCB., FDJunqing, GC., HAXirui, HE., MMReiser, PMJianliang, SH., SSLee, VBYong-Jin, WZili, XG., YM TRIAZOLOPYRIDINYL COMPOUNDS AS KINASE INHIBITORS WIPO 0:0 (2022) Target
Name:
Mixed lineage kinase domain-like protein
Synonyms:
MLKL Mixed lineage kinase domain-like protein | hMLKL
Type:
PROTEIN
Mol. Mass.:
54493.57
Organism:
Homo sapiens
Description:
ChEMBL_104428
Residue:
471
  
Inhibitor
Name:
BDBM534404
Synonyms:
WO2022086828, Example 140
Type:
Small organic molecule
Emp. Form.:
C24H21FN6O2
Mol. Mass.:
444.4609
SMILES:
Cc1ccc(c(F)c1C(=O)NCCC(O)c1cccc(c1)C#N)-c1ccn2nc(N)nc2c1
: