Target
Receptor-interacting serine/threonine-protein kinase 1
Ligand
BDBM534497
Substrate
Meas. Tech.
RIPK1 HTRF Binding Assay
IC50
0.60±n/a nM
Citation
 Guanglin, LJie, CDiane, DCB., FDJunqing, GC., HAXirui, HE., MMReiser, PMJianliang, SH., SSLee, VBYong-Jin, WZili, XG., YM TRIAZOLOPYRIDINYL COMPOUNDS AS KINASE INHIBITORS WIPO 0:0 (2022) Target
Name:
Receptor-interacting serine/threonine-protein kinase 1
Synonyms:
Cell death protein RIP RIP-1 RIPK1 Receptor-interacting protein 1
Type:
Enzyme Catalytic Domain
Mol. Mass.:
75926.99
Organism:
Homo sapiens (Human)
Description:
Q13546
Residue:
671
  
Inhibitor
Name:
BDBM534497
Synonyms:
3-(2-amino-[1,2,4]triazolo[1,5-α]pyridin-7-yl)-N-(2,2-difluoro-3-(4-fluorophenyl)-3-methoxypropyl)-2-fluoro-6-methylbenzamide WO2022086828, Example 235
Type:
Small organic molecule
Emp. Form.:
C24H21F4N5O2
Mol. Mass.:
487.4495
SMILES:
CO[C@@H](c1ccc(F)cc1)C(F)(F)CNC(=O)c1c(C)ccc(c1F)-c1ccn2nc(N)nc2c1
: