Target
Oxysterols receptor LXR-alpha
Ligand
BDBM304390
Substrate
Meas. Tech.
LXR alpha/beta Radioligand Binding Assay
Ki
41.0±n/a nM
Citation
 Claremon, DADong, CFan, YLeftheris, KLotesta, SDSingh, SBTice, CMZhao, WZheng, YZhuang, L Piperazine derivatives as liver X receptor modulators US Patent  US10144715 Publication Date 12/4/2018 
Target
Name:
Oxysterols receptor LXR-alpha
Synonyms:
LXRA Liver X receptor alpha Liver X receptor alpha (NR1H3) NR1H3 Nuclear orphan receptor LXR-alpha | Nuclear receptor subfamily 1 group H member 3
Type:
Enzyme Catalytic Domain
Mol. Mass.:
50403.85
Organism:
Homo sapiens (Human)
Description:
Q13133
Residue:
447
  
Inhibitor
Name:
BDBM304390
Synonyms:
US10144715, Compound 9-5 | methyl 2-(2-(tert-butyl)-4-(4-fluoro-3-(methylsulfonyl)phenyl)piperazin-1-yl)-4-(trifluoromethyl)pyrimidine-5-carboxylate
Type:
Small organic molecule
Emp. Form.:
C22H26F4N4O4S
Mol. Mass.:
518.525
SMILES:
COC(=O)c1cnc(nc1C(F)(F)F)N1CCN(CC1C(C)(C)C)c1ccc(F)c(c1)S(C)(=O)=O
: