Target
Replicase polyprotein 1ab
Ligand
BDBM535130
Substrate
Meas. Tech.
Antiviral activity from SARS-CoV-2 infection
EC50
492±n/a nM
Citation
 Rhys, ODYoungjin, PMRichard, RMForrest, SMBryce, TJQingyi, Y ANTIVIRAL HETEROARYL KETONE DERIVATIVES WIPO 0:0 (2022) Target
Name:
Replicase polyprotein 1ab
Synonyms:
ORF1ab polyprotein pp1ab | rep
Type:
Protein
Mol. Mass.:
794070.71
Organism:
2019-nCoV
Description:
P0DTD1
Residue:
7096
  
Inhibitor
Name:
BDBM535130
Synonyms:
WO2022013684, Example 6 | tert-Butyl {(2S)-1-[(1R,2S,5S)-2-({(2S)-1-(1,3-benzothiazol-2-yl)-1-oxo-3-[(3S)-2- oxopyrrolidin-3-yl]propan-2-yl}carbamoyl)-6,6-dimethyl-3-azabicyclo[3.1.0]hexan-3-yl]- 3,3-dimethyl-1-oxobutan-2-yl}carbamate (6)
Type:
Small organic molecule
Emp. Form.:
C32H43N5O6S
Mol. Mass.:
625.779
SMILES:
CC(C)[C@H](NC(=O)OC(C)(C)C)C(=O)N1C[C@H]2[C@@H]([C@H]1C(=O)N[C@@H](C[C@@H]1CCNC1=O)C(=O)c1nc3ccccc3s1)C2(C)C
: