Target
Replicase polyprotein 1ab
Ligand
BDBM535166
Substrate
Meas. Tech.
Antiviral activity from SARS-CoV-2 infection
EC50
129±n/a nM
Citation
 Rhys, ODYoungjin, PMRichard, RMForrest, SMBryce, TJQingyi, Y ANTIVIRAL HETEROARYL KETONE DERIVATIVES WIPO 0:0 (2022) Target
Name:
Replicase polyprotein 1ab
Synonyms:
ORF1ab polyprotein pp1ab | rep
Type:
Protein
Mol. Mass.:
794070.71
Organism:
2019-nCoV
Description:
P0DTD1
Residue:
7096
  
Inhibitor
Name:
BDBM535166
Synonyms:
WO2022013684, Example 18
Type:
Small organic molecule
Emp. Form.:
C29H39N5O6S2
Mol. Mass.:
617.78
SMILES:
CC(C)(C)[C@H](NS(C)(=O)=O)C(=O)N1C[C@H]2[C@@H]([C@H]1C(=O)N[C@@H](C[C@@H]1CCNC1=O)C(=O)c1nc3ccccc3s1)C2(C)C
: