Target
Replicase polyprotein 1ab
Ligand
BDBM535176
Substrate
Meas. Tech.
SARS-CoV-2 Coronavirus 3C Protease FRET Assay
Ki
18±n/a nM
Citation
 Shengyong, YLinli, L NOVEL CORONAVIRUS MAIN PROTEASE INHIBITOR, AND PREPARATION METHOD THEREFOR AND USE THEREOF WIPO 0:0 (2022) Target
Name:
Replicase polyprotein 1ab
Synonyms:
ORF1ab polyprotein pp1ab | rep
Type:
Protein
Mol. Mass.:
794070.71
Organism:
2019-nCoV
Description:
P0DTD1
Residue:
7096
  
Inhibitor
Name:
BDBM535176
Synonyms:
WO2022021841, 3
Type:
Small organic molecule
Emp. Form.:
C24H28Cl2FN3O5
Mol. Mass.:
528.401
SMILES:
FCC(=O)[C@H](C[C@@H]1CCNC1=O)NC(=O)C1[C@H]2CCC[C@H]2CN1C(=O)COc1ccc(Cl)cc1Cl
: