Target
Replicase polyprotein 1ab
Ligand
BDBM535222
Substrate
Meas. Tech.
SARS-CoV-2 Coronavirus 3C Protease FRET Assay
Ki
82740±n/a nM
Citation
 Shengyong, YLinli, L NOVEL CORONAVIRUS MAIN PROTEASE INHIBITOR, AND PREPARATION METHOD THEREFOR AND USE THEREOF WIPO 0:0 (2022) Target
Name:
Replicase polyprotein 1ab
Synonyms:
ORF1ab polyprotein pp1ab | rep
Type:
Protein
Mol. Mass.:
794070.71
Organism:
2019-nCoV
Description:
P0DTD1
Residue:
7096
  
Inhibitor
Name:
BDBM535222
Synonyms:
WO2022021841, 13
Type:
Small organic molecule
Emp. Form.:
C28H39N3O4
Mol. Mass.:
481.627
SMILES:
CCC[C@@H](NC(=O)C1C2[C@H](CN1C(=O)[C@H](C(C)C)c1ccccc1)C2(C)C)C(=O)C(=O)NC1CC1
: