Target
Replicase polyprotein 1ab
Ligand
BDBM535292
Substrate
Meas. Tech.
SARS-CoV-2 Coronavirus 3C Protease FRET Assay
Ki
33±n/a nM
Citation
 Shengyong, YLinli, L NOVEL CORONAVIRUS MAIN PROTEASE INHIBITOR, AND PREPARATION METHOD THEREFOR AND USE THEREOF WIPO 0:0 (2022) Target
Name:
Replicase polyprotein 1ab
Synonyms:
ORF1ab polyprotein pp1ab | rep
Type:
Protein
Mol. Mass.:
794070.71
Organism:
2019-nCoV
Description:
P0DTD1
Residue:
7096
  
Inhibitor
Name:
BDBM535292
Synonyms:
WO2022021841, 39
Type:
Small organic molecule
Emp. Form.:
C25H31Cl2N3O5
Mol. Mass.:
524.437
SMILES:
CC(C)(Oc1ccc(Cl)cc1Cl)C(=O)N1C[C@@H]2CCC[C@H]2C1C(=O)N[C@@H](C[C@@H]1CCNC1=O)C=O
: