Target
Replicase polyprotein 1ab
Ligand
BDBM535808
Substrate
Meas. Tech.
SARS-CoV-2 Coronavirus 3C Protease FRET Assay
Ki
12±n/a nM
Citation
 Shengyong, YLinli, L NOVEL CORONAVIRUS MAIN PROTEASE INHIBITOR, AND PREPARATION METHOD THEREFOR AND USE THEREOF WIPO 0:0 (2022) Target
Name:
Replicase polyprotein 1ab
Synonyms:
ORF1ab polyprotein pp1ab | rep
Type:
Protein
Mol. Mass.:
794070.71
Organism:
2019-nCoV
Description:
P0DTD1
Residue:
7096
  
Inhibitor
Name:
BDBM535808
Synonyms:
WO2022021841, 47
Type:
Small organic molecule
Emp. Form.:
C30H35N3O5
Mol. Mass.:
517.616
SMILES:
CC1CNC(=O)[C@@H]1C[C@H](NC(=O)C1[C@@H]2CCC[C@H]2CN1C(=O)COc1cccc(c1)-c1ccccc1)C=O
: