Target
Replicase polyprotein 1ab
Ligand
BDBM535818
Substrate
Meas. Tech.
SARS-CoV-2 Coronavirus 3C Protease FRET Assay
Ki
33±n/a nM
Citation
 Shengyong, YLinli, L NOVEL CORONAVIRUS MAIN PROTEASE INHIBITOR, AND PREPARATION METHOD THEREFOR AND USE THEREOF WIPO 0:0 (2022) Target
Name:
Replicase polyprotein 1ab
Synonyms:
ORF1ab polyprotein pp1ab | rep
Type:
Protein
Mol. Mass.:
794070.71
Organism:
2019-nCoV
Description:
P0DTD1
Residue:
7096
  
Inhibitor
Name:
BDBM535818
Synonyms:
WO2022021841, 56
Type:
Small organic molecule
Emp. Form.:
C23H25Cl2F2N3O5
Mol. Mass.:
532.365
SMILES:
CC1(C)[C@H]2CN(C([C@H]12)C(=O)N[C@@H](C[C@H]1C(=O)NCC1(F)F)C=O)C(=O)COc1ccc(Cl)cc1Cl
: