Target
Replicase polyprotein 1ab
Ligand
BDBM535244
Substrate
Meas. Tech.
SARS-CoV-2 in Vero E6
EC50
5630±n/a nM
Citation
 Shengyong, YLinli, L NOVEL CORONAVIRUS MAIN PROTEASE INHIBITOR, AND PREPARATION METHOD THEREFOR AND USE THEREOF WIPO 0:0 (2022) Target
Name:
Replicase polyprotein 1ab
Synonyms:
ORF1ab polyprotein pp1ab | rep
Type:
Protein
Mol. Mass.:
794070.71
Organism:
2019-nCoV
Description:
P0DTD1
Residue:
7096
  
Inhibitor
Name:
BDBM535244
Synonyms:
WO2022021841, 19
Type:
Small organic molecule
Emp. Form.:
C24H29F2N3O4
Mol. Mass.:
461.5016
SMILES:
Fc1cc(F)cc(CCC(=O)N2C[C@@H]3CCC[C@@H]3C2C(=O)N[C@@H](C[C@@H]2CCNC2=O)C=O)c1
: