Target
Replicase polyprotein 1ab
Ligand
BDBM535245
Substrate
Meas. Tech.
SARS-CoV-2 in Vero E6
EC50
1730±n/a nM
Citation
 Shengyong, YLinli, L NOVEL CORONAVIRUS MAIN PROTEASE INHIBITOR, AND PREPARATION METHOD THEREFOR AND USE THEREOF WIPO 0:0 (2022) Target
Name:
Replicase polyprotein 1ab
Synonyms:
ORF1ab polyprotein pp1ab | rep
Type:
Protein
Mol. Mass.:
794070.71
Organism:
2019-nCoV
Description:
P0DTD1
Residue:
7096
  
Inhibitor
Name:
BDBM535245
Synonyms:
WO2022021841, 20
Type:
Small organic molecule
Emp. Form.:
C25H33N3O7
Mol. Mass.:
487.5454
SMILES:
COc1ccc(OCC(=O)N2C[C@H]3[C@@H](C2C(=O)N[C@@H](C[C@@H]2CCNC2=O)C=O)C3(C)C)cc1OC
: