Target
Replicase polyprotein 1ab
Ligand
BDBM535289
Substrate
Meas. Tech.
SARS-CoV-2 in Vero E6
EC50
2230±n/a nM
Citation
 Shengyong, YLinli, L NOVEL CORONAVIRUS MAIN PROTEASE INHIBITOR, AND PREPARATION METHOD THEREFOR AND USE THEREOF WIPO 0:0 (2022) Target
Name:
Replicase polyprotein 1ab
Synonyms:
ORF1ab polyprotein pp1ab | rep
Type:
Protein
Mol. Mass.:
794070.71
Organism:
2019-nCoV
Description:
P0DTD1
Residue:
7096
  
Inhibitor
Name:
BDBM535289
Synonyms:
WO2022021841, 36
Type:
Small organic molecule
Emp. Form.:
C24H30FN3O4
Mol. Mass.:
443.5111
SMILES:
CC1(C)[C@H]2CN(C([C@@H]12)C(=O)N[C@@H](C[C@@H]1CCNC1=O)C=O)C(=O)CCc1cccc(F)c1
: