Target
Glycogen synthase kinase-3 alpha
Ligand
BDBM8339
Substrate
Biotinylated Peptide Substrate
Meas. Tech.
Kinase Inhibition SPA Assay
pH
7±n/a
Temperature
295.15±n/a K
Ki
0.19±n/a nM
Citation
 Witherington, JBordas, VHaigh, DHickey, DMIfe, RJRawlings, ADSlingsby, BPSmith, DGWard, RW 5-aryl-pyrazolo[3,4-b]pyridazines: potent inhibitors of glycogen synthase kinase-3 (GSK-3). Bioorg Med Chem Lett 13:1581-4 (2003)  
Target
Name:
Glycogen synthase kinase-3 alpha
Synonyms:
GSK-3 alpha GSK3A_HUMAN Glycogen synthase kinase-3 Glycogen synthase kinase-3 alpha (GSK3 Alpha) Glycogen synthase kinase-3 alpha (GSK3alpha)
Type:
Enzyme
Mol. Mass.:
50991.79
Organism:
Homo sapiens (Human)
Description:
P49840
Residue:
483
  
Inhibitor
Name:
BDBM8339
Synonyms:
N-[5-(2,3-difluorophenyl)-1H-pyrazolo[3,4-c]pyridazin-3-yl]-2-(1-ethylpiperidin-4-yl)acetamide | pyrazolopyridazine deriv. 19
Type:
Small organic molecule
Emp. Form.:
C20H22F2N6O
Mol. Mass.:
400.4251
SMILES:
CCN1CCC(CC(=O)Nc2n[nH]c3nnc(cc23)-c2cccc(F)c2F)CC1
:
Substrate
Name:
Biotinylated Peptide Substrate
Synonyms:
Type:
Peptide
Mol. Mass.:
3615.87
Organism:
Description:
Residue:
32