Target
Proto-oncogene tyrosine-protein kinase receptor Ret [V804M]
Ligand
BDBM305237
Substrate
Meas. Tech.
RET Enzyme Assay
IC50
61.3±n/a nM
Citation
 Andrews, SWAronow, SBlake, JFBrandhuber, BJCollier, JCook, AHaas, JJiang, YKolakowski, GRMcFaddin, EAMcKenney, MLMcNulty, OTMetcalf, ATMoreno, DARamann, GATang, TPRen, LWalls, SM Substituted pyrazolo[1,5-A]pyridine compounds as RET kinase inhibitors US Patent  US10144734 Publication Date 12/4/2018 
Target
Name:
Proto-oncogene tyrosine-protein kinase receptor Ret [V804M]
Synonyms:
CDHF12 PTC RET RET51 ret enzyme (v804m)
Type:
Enzyme Catalytic Domain
Mol. Mass.:
124350.36
Organism:
Homo sapiens (Human)
Description:
P07949[V804M]
Residue:
1114
  
Inhibitor
Name:
BDBM305237
Synonyms:
US10144734, Example 253 US10441581, Example 253 US11648243, Example 253
Type:
Small organic molecule
Emp. Form.:
C27H27FN6O3
Mol. Mass.:
502.5401
SMILES:
CC(C)(O)COc1cc(-c2ccc(nc2)N2CCC(CC2)Oc2ccc(F)cn2)c2c(cnn2c1)C#N
: