Target
Proto-oncogene tyrosine-protein kinase receptor Ret [V804M]
Ligand
BDBM305276
Substrate
Meas. Tech.
RET Enzyme Assay
IC50
123±n/a nM
Citation
 Andrews, SWAronow, SBlake, JFBrandhuber, BJCollier, JCook, AHaas, JJiang, YKolakowski, GRMcFaddin, EAMcKenney, MLMcNulty, OTMetcalf, ATMoreno, DARamann, GATang, TPRen, LWalls, SM Substituted pyrazolo[1,5-A]pyridine compounds as RET kinase inhibitors US Patent  US10144734 Publication Date 12/4/2018 
Target
Name:
Proto-oncogene tyrosine-protein kinase receptor Ret [V804M]
Synonyms:
CDHF12 PTC RET RET51 ret enzyme (v804m)
Type:
Enzyme Catalytic Domain
Mol. Mass.:
124350.36
Organism:
Homo sapiens (Human)
Description:
P07949[V804M]
Residue:
1114
  
Inhibitor
Name:
BDBM305276
Synonyms:
N-(1-(5-(3-cyano-6-(2- hydroxy-2- methylpropoxy)pyrazolo [1,5-a]pyridin-4-yl)pyridin- 2-yl)piperidin-4- yl)picolinamide US10172845, Example 292 US10881652, Example 292 | US11648243, Example 292
Type:
Small organic molecule
Emp. Form.:
C28H29N7O3
Mol. Mass.:
511.575
SMILES:
CC(C)(O)COc1cc(-c2ccc(nc2)N2CCC(CC2)NC(=O)c2ccccn2)c2c(cnn2c1)C#N
: