Target
Proto-oncogene tyrosine-protein kinase receptor Ret
Ligand
BDBM305432
Substrate
Meas. Tech.
RET Enzyme Assay
IC50
85.4±n/a nM
Citation
 Andrews, SWAronow, SBlake, JFBrandhuber, BJCollier, JCook, AHaas, JJiang, YKolakowski, GRMcFaddin, EAMcKenney, MLMcNulty, OTMetcalf, ATMoreno, DARamann, GATang, TPRen, LWalls, SM Substituted pyrazolo[1,5-A]pyridine compounds as RET kinase inhibitors US Patent  US10144734 Publication Date 12/4/2018 
Target
Name:
Proto-oncogene tyrosine-protein kinase receptor Ret
Synonyms:
CDHF12 Cadherin family member 12 Proto-oncogene c-Ret RET51 Tyrosine-protein kinase Ret (RET)
Type:
Protein
Mol. Mass.:
124318.29
Organism:
Homo sapiens (Human)
Description:
P07949
Residue:
1114
  
Inhibitor
Name:
BDBM305432
Synonyms:
US10144734, Example 449 US10441581, Example 449 US11648243, Example 449
Type:
Small organic molecule
Emp. Form.:
C29H31FN6O
Mol. Mass.:
498.5944
SMILES:
CCOc1cc(-c2ccc(nc2)N2CCC(C)(CC2)NCc2cc(F)ccc2C)c2c(cnn2c1)C#N
: