Target
Eukaryotic translation initiation factor 4E-binding protein 1
Ligand
BDBM545212
Substrate
Meas. Tech.
Fluorescence Polarization Assay
IC50
3.40±n/a nM
Citation
 Sperry, SXiang, AXErnst, JTReich, SHSprengeler, PAShaghafi, MMichels, TNilewski, CTran, CVPackard, GKGrubbs, AUrkalan, KMukaiyama, T EIF4E-inhibiting compounds and methods US Patent  US11286268 Publication Date 3/29/2022 
Target
Name:
Eukaryotic translation initiation factor 4E-binding protein 1
Synonyms:
4EBP1_HUMAN GFP-4EBP Green fluorescent protein-Eukaryotic initiation factor 4E (eIF4E) binding protein
Type:
Fusion protein
Mol. Mass.:
12578.35
Organism:
Homo sapiens (Human)
Description:
Residue:
118
  
Inhibitor
Name:
BDBM545212
Synonyms:
US11286268, Compound 698
Type:
Small organic molecule
Emp. Form.:
C30H23Cl2N5O5S
Mol. Mass.:
636.505
SMILES:
Cc1cc(-c2cc(Cl)ccc2OCCn2c(C)nc3cc(Cl)c(N4CC(O)C4)c(C#N)c3c2=O)c2scc(C(O)=O)c2n1
: