Target
Epidermal growth factor receptor [1-18,20-1210,T790M,C797S]
Ligand
BDBM547867
Substrate
Meas. Tech.
Ba/F3 cell model generation and proliferation assays
IC50
1.30±n/a nM
Citation
 Harald, EMark, PJuergen, RUlrich, RHeinz, SDirk, STobias, W SUBSTITUTED 1H-PYRAZOLO[4,3-C]PYRIDINES AND DERIVATIVES AS EGFR INHIBITORS WIPO 0:0 (2022) Target
Name:
Epidermal growth factor receptor [1-18,20-1210,T790M,C797S]
Synonyms:
EGFR ERBB Epidermal growth factor receptor (EGFR)(del19/T790M/C797S) | HER1
Type:
Enzyme Catalytic Domain
Mol. Mass.:
134190.47
Organism:
Homo sapiens (Human)
Description:
P00533[1-18,20-1210,T790M,C797S]
Residue:
1209
  
Inhibitor
Name:
BDBM547867
Synonyms:
WO2022090481, Example I-086
Type:
Small organic molecule
Emp. Form.:
C29H32N8O3
Mol. Mass.:
540.6162
SMILES:
COc1ccncc1-c1cc2n(ncc2c(C)n1)-c1cc2n(C)c(C(=O)N(C)C)c(C)c2c(n1)N1CCOCC1
: