Target
Epidermal growth factor receptor [1-18,20-1210,T790M,C797S]
Ligand
BDBM547879
Substrate
Meas. Tech.
Ba/F3 cell model generation and proliferation assays
IC50
0.90±n/a nM
Citation
 Harald, EMark, PJuergen, RUlrich, RHeinz, SDirk, STobias, W SUBSTITUTED 1H-PYRAZOLO[4,3-C]PYRIDINES AND DERIVATIVES AS EGFR INHIBITORS WIPO 0:0 (2022) Target
Name:
Epidermal growth factor receptor [1-18,20-1210,T790M,C797S]
Synonyms:
EGFR ERBB Epidermal growth factor receptor (EGFR)(del19/T790M/C797S) | HER1
Type:
Enzyme Catalytic Domain
Mol. Mass.:
134190.47
Organism:
Homo sapiens (Human)
Description:
P00533[1-18,20-1210,T790M,C797S]
Residue:
1209
  
Inhibitor
Name:
BDBM547879
Synonyms:
WO2022090481, Example I-098
Type:
Small organic molecule
Emp. Form.:
C30H33N7O3S
Mol. Mass.:
571.693
SMILES:
COc1ccncc1-c1cc2n(ncc2c(C)n1)-c1cc2n(C)c(C(=O)N3CCS(=O)CC3)c(C)c2c(n1)C(C)C
: