Target
Interleukin-17 receptor A/
Ligand
BDBM548055
Substrate
Meas. Tech.
Human IL-17A x IL-17RA TR-FRET assay
IC50
17±n/a nM
Citation
 Josef, TTDavid, OPascal, FKlaus, WAchim, S INTERLEUKIN-17 INHIBITORS WIPO 0:0 (2022) Target
Name:
Interleukin-17 receptor A/
Synonyms:
Human IL-17A/IL-17RA | Interleukin-17A/Interleukin-17 receptor A
Type:
Protein
Mol. Mass.:
Description:
Components:
This complex has 2 components.
Component 1
Name:
Interleukin-17A
Synonyms:
CTLA8 IL-17 IL17A il-17a
Type:
Enzyme Catalytic Domain
Mol. Mass.:
17511.44
Organism:
Homo sapiens (Human)
Description:
Q16552
Residue:
155
  
Component 2
Name:
Interleukin-17 receptor A
Synonyms:
CDw217 IL-17 receptor A IL17R | IL17RA
Type:
Protein
Mol. Mass.:
96092.10
Organism:
Human
Description:
Q96F46
Residue:
866
  
Inhibitor
Name:
BDBM548055
Synonyms:
WO2022091056, Example 47
Type:
Small organic molecule
Emp. Form.:
C25H29ClN6O3
Mol. Mass.:
496.989
SMILES:
Cc1cc[n+]([O-])c(Cl)c1-c1ccc(NC(=O)[C@@H](NC(=O)c2ccnn2C)C2CCCCCC2)nc1
: