Target
Lethal factor
Ligand
BDBM8437
Substrate
MAPKKide
Meas. Tech.
Fluorescence Peptide Cleavage Assay
IC50
900±n/a nM
Citation
 Forino, MJohnson, SWong, TYRozanov, DVSavinov, AYLi, WFattorusso, RBecattini, BOrry, AJJung, DAbagyan, RASmith, JWAlibek, KLiddington, RCStrongin, AYPellecchia, M Efficient synthetic inhibitors of anthrax lethal factor. Proc Natl Acad Sci U S A 102:9499-504 (2005)  
Target
Name:
Lethal factor
Synonyms:
Anthrax Lethal Factor (LF) Antrax lethal toxin lef | lethal factor
Type:
PROTEIN
Mol. Mass.:
93758.56
Organism:
Bacillus anthracis
Description:
ChEMBL_1460338
Residue:
809
  
Inhibitor
Name:
BDBM8437
Synonyms:
2-[(5Z)-5-{[5-(4-chlorophenyl)furan-2-yl]methylidene}-4-oxo-2-sulfanylidene-1,3-thiazolidin-3-yl]acetic acid Rhodanine analogue | {5-[5-(4-Chloro-phenyl)-furan-2-ylmethylene]-4-oxo-2-thioxo-thiazolidin-3-yl}-acetic acid
Type:
Small organic molecule
Emp. Form.:
C16H10ClNO4S2
Mol. Mass.:
379.838
SMILES:
OC(=O)CN1C(=S)S\C(=C/c2ccc(o2)-c2ccc(Cl)cc2)C1=O
:
Substrate
Name:
MAPKKide
Synonyms:
Type:
Peptide
Mol. Mass.:
358.43
Organism:
Description:
MAPPKKide is a quenched fluoresent substrate peptide based on fluorescence resonance energy transfer (FRET). The C-terminally linked fluorophore of MAPKKide is a FITC, and the acceptor chromophore is 4-([4-(dimethylamino)-phenyl] azo) benzoic acid (DABCYL) (List Biological Laboratories, Inc, Campbell, CA).
Residue:
3
NA