Target
Phosphatidylinositol 3-kinase catalytic subunit type 3
Ligand
BDBM548262
Substrate
Meas. Tech.
VPS34 ADP-Glo kinase assay
IC50
1300±n/a nM
Citation
 Snahel, PMichael, SShumei, WHuifen, CX., HD SUBSTITUTED MORPHOLINE COMPOUNDS WIPO 0:0 (2022) Target
Name:
Phosphatidylinositol 3-kinase catalytic subunit type 3
Synonyms:
BC033004 PIK3C3 Phosphatidylinositol 3-kinase catalytic subunit type 3 (PIK3C3) Phosphoinositide 3-Kinase (PI3K), Vps34 PtdIns-3-kinase type 3 hVPS34
Type:
Enzyme
Mol. Mass.:
101551.30
Organism:
Homo sapiens (Human)
Description:
Recombinant human Vps34 protein was expressed as monomeric GST-fusion and purified.
Residue:
887
  
Inhibitor
Name:
BDBM548262
Synonyms:
(S)-7-cyclopropyl-7-ethyl-2-((R)-3-methylmorpholino)-6,7-dihydropyrazolo[1,5-a]pyrazin-4(5H)-one | WO2022093820, Compound 28
Type:
Small organic molecule
Emp. Form.:
C16H24N4O2
Mol. Mass.:
304.3874
SMILES:
CC[C@@]1(CNC(=O)c2cc(nn12)N1CCOC[C@H]1C)C1CC1
: