Target
GTPase KRas [1-169,G12C,C118A]
Ligand
BDBM548322
Substrate
IC50
4165±n/a nM
Citation
 Alan, LBAbhisek, BMargaret, CDongcheng, DR., KMPatricia, LVan, MVFrancesco, MM., MJJ., PAA., TNKai, Z HETEROCYCLIC SPIRO COMPOUNDS AND METHODS OF USE WIPO 0:0 (2022) Target
Name:
GTPase KRas [1-169,G12C,C118A]
Synonyms:
GTPase KRas KRAS2 RASK_HUMAN
Type:
PROTEIN
Mol. Mass.:
19407.24
Organism:
Homo sapiens (Human)
Description:
P01116[1-169,G12C,C118A]
Residue:
169
  
Inhibitor
Name:
BDBM548322
Synonyms:
WO2022093856, Example 1-19
Type:
Small organic molecule
Emp. Form.:
C25H36N8O
Mol. Mass.:
464.6063
SMILES:
CC(C)C[C@@H](Cc1nnc[nH]1)Nc1nc(nc2CCCCc12)N1CCC2(CN(C2)C(=O)C=C)C1
: