Target
GTPase KRas [1-169,G12C,C118A]
Ligand
BDBM548360
Substrate
IC50
57±n/a nM
Citation
 Alan, LBAbhisek, BMargaret, CDongcheng, DR., KMPatricia, LVan, MVFrancesco, MM., MJJ., PAA., TNKai, Z HETEROCYCLIC SPIRO COMPOUNDS AND METHODS OF USE WIPO 0:0 (2022) Target
Name:
GTPase KRas [1-169,G12C,C118A]
Synonyms:
GTPase KRas KRAS2 RASK_HUMAN
Type:
PROTEIN
Mol. Mass.:
19407.24
Organism:
Homo sapiens (Human)
Description:
P01116[1-169,G12C,C118A]
Residue:
169
  
Inhibitor
Name:
BDBM548360
Synonyms:
WO2022093856, Example 1-55
Type:
Small organic molecule
Emp. Form.:
C27H40N8O
Mol. Mass.:
492.6595
SMILES:
CC(C)C[C@@H](Cc1c[nH]nn1)Nc1nc(nc2CC(C)(C)CCc12)N1CCC2(CN(C2)C(=O)C=C)C1
: