Target
Leucine-rich repeat serine/threonine-protein kinase 2 [G2019S]
Ligand
BDBM548556
Substrate
Meas. Tech.
LRRK2 Km ATP LanthaScreen Assay
IC50
0.08±n/a nM
Citation
 H., FPAnmol, GD., KSH., KMA., MKXin, Y N-LINKED ISOQUINOLINE AMIDES AS LRRK2 INHIBITORS, PHARMACEUTICAL COMPOSITIONS, AND USES THEREOF WIPO 0:0 (2022) Target
Name:
Leucine-rich repeat serine/threonine-protein kinase 2 [G2019S]
Synonyms:
LRRK2 LRRK2_HUMAN Leucine-rich repeat serine/threonine-protein kinase 2 (LRRK2)(G2019S) PARK8
Type:
Mol. Mass.:
286143.23
Organism:
Homo sapiens (Human)
Description:
Q5S007(G2019S)
Residue:
2527
  
Inhibitor
Name:
BDBM548556
Synonyms:
WO2022093881, Ex-10.65
Type:
Small organic molecule
Emp. Form.:
C28H35ClN6O3
Mol. Mass.:
539.069
SMILES:
CC[C@H]1[C@H]([C@@H]1c1ccn(C)n1)C(=O)Nc1cc2cc(N3CCN(CC3)[C@]3(C)COC[C@@H]3O)c(Cl)cc2cn1
: