Target
Mitogen-activated protein kinase kinase kinase kinase 1
Ligand
BDBM548822
Substrate
Meas. Tech.
HPK1-SLP76 TR-FRET ASSAY
IC50
0.04±n/a nM
Citation
 A., CDL., CJAnthony, DXavier, FH., FPShuhei, KBing, LJongwon, LPing, LL., MJG., NAAlexander, PA., VBC., YE 7-PHENYL SUBSTITUTED 2-AMINOQUINAZOLINE INHIBITORS OF HPK1 WIPO 0:0 (2022) Target
Name:
Mitogen-activated protein kinase kinase kinase kinase 1
Synonyms:
HPK1 MAP4K1
Type:
PROTEIN
Mol. Mass.:
91316.07
Organism:
Homo sapiens (Human)
Description:
ChEMBL_586597
Residue:
833
  
Inhibitor
Name:
BDBM548822
Synonyms:
WO2022098806, Compound 2-83
Type:
Small organic molecule
Emp. Form.:
C29H30FN7O2
Mol. Mass.:
527.5926
SMILES:
CNC(=O)C1(CCCC1)c1ccc(Nc2ncc3c(N)c(F)c(cc3n2)-c2cnc3OCCNc3c2C)cc1
: