Target
Mitogen-activated protein kinase kinase kinase kinase 1
Ligand
BDBM548824
Substrate
Meas. Tech.
HPK1-SLP76 TR-FRET ASSAY
IC50
0.03±n/a nM
Citation
 A., CDL., CJAnthony, DXavier, FH., FPShuhei, KBing, LJongwon, LPing, LL., MJG., NAAlexander, PA., VBC., YE 7-PHENYL SUBSTITUTED 2-AMINOQUINAZOLINE INHIBITORS OF HPK1 WIPO 0:0 (2022) Target
Name:
Mitogen-activated protein kinase kinase kinase kinase 1
Synonyms:
HPK1 MAP4K1
Type:
PROTEIN
Mol. Mass.:
91316.07
Organism:
Homo sapiens (Human)
Description:
ChEMBL_586597
Residue:
833
  
Inhibitor
Name:
BDBM548824
Synonyms:
WO2022098806, Compound 2-85
Type:
Small organic molecule
Emp. Form.:
C27H28FN7O
Mol. Mass.:
485.5559
SMILES:
C[C@H]1Cc2ccc(Nc3ncc4c(N)c(F)c(cc4n3)-c3cnc4OCCNc4c3C)cc2CN1C
: