Target
Mitogen-activated protein kinase kinase kinase kinase 1
Ligand
BDBM548859
Substrate
Meas. Tech.
HPK1-SLP76 TR-FRET ASSAY
IC50
0.01±n/a nM
Citation
 A., CDL., CJAnthony, DXavier, FH., FPShuhei, KBing, LJongwon, LPing, LL., MJG., NAAlexander, PA., VBC., YE 7-PHENYL SUBSTITUTED 2-AMINOQUINAZOLINE INHIBITORS OF HPK1 WIPO 0:0 (2022) Target
Name:
Mitogen-activated protein kinase kinase kinase kinase 1
Synonyms:
HPK1 MAP4K1
Type:
PROTEIN
Mol. Mass.:
91316.07
Organism:
Homo sapiens (Human)
Description:
ChEMBL_586597
Residue:
833
  
Inhibitor
Name:
BDBM548859
Synonyms:
WO2022098806, Compound 2-120
Type:
Small organic molecule
Emp. Form.:
C26H26FN7O
Mol. Mass.:
471.5293
SMILES:
Cc1c2NCCOc2ncc1-c1cc2nc(Nc3ccc4CCCNCc4c3)ncc2c(N)c1F
: