Target
Mitogen-activated protein kinase kinase kinase kinase 1
Ligand
BDBM548846
Substrate
Meas. Tech.
HPK1-SLP76 TR-FRET ASSAY
IC50
0.03±n/a nM
Citation
 A., CDL., CJAnthony, DXavier, FH., FPShuhei, KBing, LJongwon, LPing, LL., MJG., NAAlexander, PA., VBC., YE 7-PHENYL SUBSTITUTED 2-AMINOQUINAZOLINE INHIBITORS OF HPK1 WIPO 0:0 (2022) Target
Name:
Mitogen-activated protein kinase kinase kinase kinase 1
Synonyms:
HPK1 MAP4K1
Type:
PROTEIN
Mol. Mass.:
91316.07
Organism:
Homo sapiens (Human)
Description:
ChEMBL_586597
Residue:
833
  
Inhibitor
Name:
BDBM548846
Synonyms:
WO2022098806, Compound 2-107 WO2022098806, Compound 2-185
Type:
Small organic molecule
Emp. Form.:
C26H24ClF2N7O
Mol. Mass.:
523.965
SMILES:
CN1CCc2cc(F)c(Nc3ncc4c(N)c(F)c(c(Cl)c4n3)-c3cnc4OCCNc4c3C)cc2C1
: