Target
Lethal factor
Ligand
BDBM8476
Substrate
Peptide Substrate
Meas. Tech.
Fluorescence Resonance Energy Transfer Assay (FRET)
pH
7±n/a
Temperature
295.15±n/a K
IC50
290±n/a nM
Citation
 Xiong, YWiltsie, JWoods, AGuo, JPivnichny, JVTang, WBansal, ACummings, RTCunningham, BRFriedlander, AMDouglas, CMSalowe, SPZaller, DMScolnick, EMSchmatz, DMBartizal, KHermes, JDMacCoss, MChapman, KT The discovery of a potent and selective lethal factor inhibitor for adjunct therapy of anthrax infection. Bioorg Med Chem Lett 16:964-8 (2006)  
Target
Name:
Lethal factor
Synonyms:
Anthrax Lethal Factor (LF) Antrax lethal toxin lef | lethal factor
Type:
PROTEIN
Mol. Mass.:
93758.56
Organism:
Bacillus anthracis
Description:
ChEMBL_1460338
Residue:
809
  
Inhibitor
Name:
BDBM8476
Synonyms:
(2R)-2-[(4-fluorobenzene)sulfonamido]-N-hydroxy-3-methylbutanamide | hydroxamate analogue 13
Type:
Small organic molecule
Emp. Form.:
C11H15FN2O4S
Mol. Mass.:
290.311
SMILES:
CC(C)[C@@H](NS(=O)(=O)c1ccc(F)cc1)C(=O)NO
:
Substrate
Name:
Peptide Substrate
Synonyms:
(Cou)Consensus(K(QSY-35)GG)-NH2
Type:
Peptide
Mol. Mass.:
9139.37
Organism:
Description:
Residue:
78