Target
Lethal factor
Ligand
BDBM8508
Substrate
Peptide Substrate
Meas. Tech.
Fluorescence Resonance Energy Transfer Assay (FRET)
IC50
65±n/a nM
Citation
 Xiong, YWiltsie, JWoods, AGuo, JPivnichny, JVTang, WBansal, ACummings, RTCunningham, BRFriedlander, AMDouglas, CMSalowe, SPZaller, DMScolnick, EMSchmatz, DMBartizal, KHermes, JDMacCoss, MChapman, KT The discovery of a potent and selective lethal factor inhibitor for adjunct therapy of anthrax infection. Bioorg Med Chem Lett 16:964-8 (2006)  
Target
Name:
Lethal factor
Synonyms:
Anthrax Lethal Factor (LF) Antrax lethal toxin lef | lethal factor
Type:
PROTEIN
Mol. Mass.:
93758.56
Organism:
Bacillus anthracis
Description:
ChEMBL_1460338
Residue:
809
  
Inhibitor
Name:
BDBM8508
Synonyms:
(2R,3S)-3-cyclopropyl-2-[(4-fluoro-3-methylbenzene)sulfonamido]-N-hydroxybutanamide | hydroxamate analogue 45
Type:
Small organic molecule
Emp. Form.:
C14H19FN2O4S
Mol. Mass.:
330.375
SMILES:
C[C@H]([C@@H](NS(=O)(=O)c1ccc(F)c(C)c1)C(=O)NO)C1CC1
:
Substrate
Name:
Peptide Substrate
Synonyms:
(Cou)Consensus(K(QSY-35)GG)-NH2
Type:
Peptide
Mol. Mass.:
9139.37
Organism:
Description:
Residue:
78