Target
Lethal factor
Ligand
BDBM8510
Substrate
Peptide Substrate
Meas. Tech.
Fluorescence Resonance Energy Transfer Assay (FRET)
IC50
59±n/a nM
Citation
 Xiong, YWiltsie, JWoods, AGuo, JPivnichny, JVTang, WBansal, ACummings, RTCunningham, BRFriedlander, AMDouglas, CMSalowe, SPZaller, DMScolnick, EMSchmatz, DMBartizal, KHermes, JDMacCoss, MChapman, KT The discovery of a potent and selective lethal factor inhibitor for adjunct therapy of anthrax infection. Bioorg Med Chem Lett 16:964-8 (2006)  
Target
Name:
Lethal factor
Synonyms:
Anthrax Lethal Factor (LF) Antrax lethal toxin lef | lethal factor
Type:
PROTEIN
Mol. Mass.:
93758.56
Organism:
Bacillus anthracis
Description:
ChEMBL_1460338
Residue:
809
  
Inhibitor
Name:
BDBM8510
Synonyms:
(2R)-2-[(4-fluoro-3-methylbenzene)sulfonamido]-4-[(1S)-1-formamidoethan-1-aminium]-N-hydroxybutanamide | hydroxamate analogue 47
Type:
Small organic molecule
Emp. Form.:
C14H22FN4O5S
Mol. Mass.:
377.411
SMILES:
C[C@H]([NH3+])C(=O)NCC[C@@H](NS(=O)(=O)c1ccc(F)c(C)c1)C(=O)NO
:
Substrate
Name:
Peptide Substrate
Synonyms:
(Cou)Consensus(K(QSY-35)GG)-NH2
Type:
Peptide
Mol. Mass.:
9139.37
Organism:
Description:
Residue:
78